{"text_format":"1","workbook":"xlsx","n_sheets":4,"sheets":["DATA ","Readme","Summary","Entry"],"not_rendered":{"charts":0,"images":3,"macros":1,"external_links":0,"defined_names":10,"comments":0,"pivot_tables":0},"unopened":[],"bounds":{"document_bytes":16777216,"sheet_cells":100000,"rows_first":2000,"rows_last":500,"rows_between":2000,"halvings":0,"cell_chars":16384,"cell_head_chars":4096},"cells_cut":0,"cells_raw":0,"read":"whole","date_system":"1900"}

{"sheet":"DATA ","index":0,"n_rows":222,"n_cols":32,"rows_kept":222,"cut":false,"hidden":true,"merged":[]}
[null,"ISMC",null,null,"ISMB",null,null,"ISA",null,null," UNEQUAL ANGLES",null,null,"M.S FLAT",null,null,"Plate",null,null,"Round Bar",null,null,"Square Hollow Tube"]
["ISMB","ISMC 75 x 40",7.1260000000000003,null,"ISLB 100 X 50",8,null,"ISA 20x20x3",0.89900000000000002,null,"Uneq ISA 30x20x3",1.1000000000000001,null,"M.S FLAT 12 x 3 ",0.28299999999999997,null,"PLATE 5 mm",39.25,null,"Round Bar 8 mm",0.39500000000000002,null,"20x20x5mm",2.355,null,null,null,null,"ISMC 75 x 40",7.1260000000000003,"Rmtr."]
["ISMC","ISMC 100 x 50",9.5969999999999995,null,"ISMB 116 X 100",23,null,"ISA 25x25x3",1.099,null,"Uneq ISA 30x20x4",1.4,null,"M.S FLAT 12 x 5 ",0.47099999999999997,null,"PLATE 6 mm",{"$f":"ROUND(6*7.85,3)","v":47.1},null,"Round Bar 10 mm",0.61699999999999999,null,"25x25x5mm",3.14,null,null,null,null,"ISMC 100 x 50",9.5969999999999995,"Rmtr."]
["ISA","ISMC 125 x 65",13.098000000000001,null,"ISMB 100 x 50","11.20",null,"ISA 25x25x5",1.798,null,"Uneq ISA 30x20x5",1.8,null,"M.S FLAT 16 x 5 ",0.628,null,"PLATE 8 mm",62.8,null,"Round Bar 12 mm",0.88800000000000001,null,"32x32x5mm",4.2389999999999999,null,null,null,null,"ISMC 125 x 65",13.098000000000001,"Rmtr."]
["MSFLAT","ISMC 150 x 75",16.798999999999999,null,"ISMB 125 x 65 ","13.20",null,"ISA 31x31x3",1.28,null,"Uneq ISA 40x25x3",1.5,null,"M.S FLAT 20 x 5 ",0.78500000000000003,null,"PLATE 10 mm",78.5,null,"Round Bar 16 mm",1.58,null,"40x40x5mm",5.4950000000000001,null,null,null,null,"ISMC 150 x 75",16.798999999999999,"Rmtr."]
["PLATE","ISMC 175 x 75",19.597000000000001,null,"ISMB 150 x 75 ","14.50",null,"ISA 35x35x5",2.5990000000000002,null,"Uneq ISA 40x25x4",1.9,null,"M.S FLAT 25 x 5 ",0.98099999999999998,null,"PLATE 12 mm",94.2,null,"Round Bar 20 mm",2.4700000000000002,null,"50x50x5mm",7.0650000000000004,null,null,null,null,"ISMC 175 x 75",19.597000000000001,"Rmtr."]
["RoundBar","ISMC 200 x 75",22.297999999999998,null,"ISMB  175 x 75","15.00",null,"ISA 37x37x3",1.7,null,"Uneq ISA 40x25x5",2.4,null,"M.S FLAT 32 x 5 ",1.256,null,"PLATE 16 mm",125.6,null,"Round Bar 25 mm",3.58,null,"65x65x5mm",9.42,null,null,null,null,"ISMC 200 x 75",22.297999999999998,"Rmtr."]
["UNEQUALANGLE","ISMC 225 x 75",22.32,null,"ISMB 175 X 85",19.5,null,"ISA 40x40x3",1.798,null,"Uneq ISA 40x25x6",2.8,null,"M.S FLAT 35 x 5 ",1.3740000000000001,null,"PLATE 20 mm",157,null,"Round Bar 28 mm",4.8390000000000004,null,"75x55x5mm",9.42,null,null,null,null,"ISMC 2250 x 75",22.32,"Rmtr."]
["SquareHollowTube","ISMC 250 x 80",30.599,null,"ISMB 150 X 80",15,null,"ISA 40x40x5",3.0019999999999998,null,"Uneq ISA 45x30x3",1.7,null,"M.S FLAT 40 x 5 ",1.57,null,"PLATE 25 mm",196.25,null,"Round Bar 32 mm",6.32,null,"20x45x5mm",4.71,null,null,null,null,"ISMC 250 x 80",30.599,"Rmtr."]
["Cpurlin ","ISMC 300 x 90",36.298000000000002,null,"ISMB 200 x 75 ","19.50",null,"ISA 40x40x6",3.4980000000000002,null,"Uneq ISA 45x30x4",2.2000000000000002,null,"M.S FLAT 45 x 5 ",1.766,null,"PLATE 30 mm",235.5,null,"Round Bar 40 mm",9.8759999999999994,null,"25x65x5mm",6.5949999999999998,null,null,null,null,"ISMC 300 x 90",36.298000000000002,"Rmtr."]
[null,"ISMC 400 x 100",49.4,null,"ISMB 200 X 100",25.4,null,"ISA 45x45x5",3.5,null,"Uneq ISA 45x30x5",2.8,null,"M.S FLAT 50 x 5 ",1.9630000000000001,null,"PLATE 32 mm",251.2,null,null,null,null,"32x65x5mm",7.3,null,null,null,null,"ISMC 400 x 100",50.3,"Rmtr."]
[null,"C Purling 250x2,5mm",null,null,"ISMB 225 x 80 ","25.90",null,"ISA 50x50x5",3.7989999999999999,null,"Uneq ISA 45x30x6",3.3,null,"M.S FLAT 20 x 6 ",0.94199999999999995,null,"PLATE 40 mm",314,null,null,null,null,"40x100x5mm",10.210000000000001,null,null,null,null,"C Purling 250x2,5mm",7.2,"Rmtr."]
[null,null,null,null,"ISMB 225 X 110",31.2,null,"ISA 50x50x6",4.5019999999999998,null,"Uneq ISA 50x30x3",1.8,null,"M.S FLAT 25 x 6 ",1.1779999999999999,null,null,null,null,32]
[null,null,null,null,"ISMB 250 X 125",37.299999999999997,null,"ISA 60x60x6",5.3970000000000002,null,"Uneq ISA 50x30x4",2.4,null,"M.S FLAT 32 x 6 ",1.5069999999999999,null,null,null,null,5]
[null,null,null,null,"ISMB 250 x 125 ","38.10",null,"ISA 65x65x6",5.798,null,"Uneq ISA 50x30x5",3,null,"M.S FLAT 35 x 6 ",1.649,null,null,null,null,{"$f":"T13*T14*7850","v":1256000}]
[null,null,null,null,"ISMB 300 X 150",37.700000000000003,null,"ISA 65x65x8",7.6970000000000001,null,"Uneq ISA 50x30x6",3.5,null,"M.S FLAT 40 x 6 ",1.8839999999999999,null,null,null,null,{"$f":"T15/1000","v":1256},null,null,null,null,null,null,null,null,"ISLB 100 X 50",8,"Rmtr."]
[null,null,null,null,"ISMB 300 X 140",44.2,null,"ISA 65x65x10",9.3970000000000002,null,"Uneq ISA 60x40x5",3.7,null,"M.S FLAT 45 x 6 ",2.12,null,null,null,null,{"$f":"T16/1000","v":1.256},null,null,null,null,null,null,null,null,"ISMB 116 X 100",23,"Rmtr."]
[null,null,null,null,"ISMB 350 X 165",49.5,null,"ISA 75x75x6",6.798,null,"Uneq ISA 60x40x6",4.4000000000000004,null,"M.S FLAT 50 x 6 ",2.355,null,null,null,null,null,null,null,null,null,null,null,null,null,"ISMB 100 x 50","11.20","Rmtr."]
[null,null,null,null,"ISMB 350 X 140",52.4,null,"ISA 75x75x8",8.8979999999999997,null,"Uneq ISA 60x40x8",5.8,null,"M.S FLAT 63 x 6 ",2.9670000000000001,null,null,null,null,null,null,null,null,null,null,null,null,null,"ISMB 125 x 65 ","13.20","Rmtr."]
[null,null,null,null,"ISMB 400 X 140",61.6,null,"ISA 75x75x10",10.997999999999999,null,"Uneq ISA 65x45x5",4.0999999999999996,null,"M.S FLAT 75 x 6 ",3.5329999999999999,null,null,null,null,null,null,null,null,null,null,null,null,null,"ISMB 150 x 75 ","14.50","Rmtr."]
[null,null,null,null,"ISMB 400 X 165",56.9,null,"ISA 80x80x6",7.2969999999999997,null,"Uneq ISA 65x45x6",4.9000000000000004,null,"M.S FLAT 100 x 6",0.47099999999999997,null,null,null,null,null,null,null,null,null,null,null,null,null,"ISMB  175 x 75","15.00","Rmtr."]
[null,null,null,null,"ISMB 450 X 150",72.400000000000006,null,"ISA 80x80x8",9.5969999999999995,null,"Uneq ISA 65x45x8",6.4,null,"M.S FLAT 25 x 8 ",1.57,null,null,null,null,null,null,null,null,null,null,null,null,null,"ISMB 175 X 85",19.5,"Rmtr."]
[null,null,null,null,"ISMB 500 X 180",86.92,null,"ISA 90x90x6",8.1989999999999998,null,"Uneq ISA 70x45x5",4.3,null,"M.S FLAT 32 x 8 ",2.0099999999999998,null,null,null,null,null,null,null,null,null,null,null,null,null,"ISMB 150 X 80",15,"Rmtr."]
[null,null,null,null,"ISMB 600 X 210",122.6,null,"ISA 90x90x8",10.801,null,"Uneq ISA 70x45x6",5.2,null,"M.S FLAT 35 x 8 ",2.198,null,null,null,null,null,null,null,null,null,null,null,null,null,"ISMB 200 x 75 ","19.50","Rmtr."]
[null,null,null,null,null,null,null,"ISA 90x90x10",13.4,null,"Uneq ISA 70x45x6",6.7,null,"M.S FLAT 32 x 20",5.024,null,null,null,null,null,null,null,null,null,null,null,null,null,"ISMB 200 X 100",25.4,"Rmtr."]
[null,null,null,null,null,null,null,"ISA 100x100x6",9.1999999999999993,null,"Uneq ISA 70x45x6",8.3000000000000007,null,"M.S FLAT 40 x 8 ",2.512,null,null,null,null,null,null,null,null,null,null,null,null,null,"ISMB 225 x 80 ","25.90","Rmtr."]
[null,null,null,null,null,null,null,"ISA 100x100x8",12.097,null,"Uneq ISA 75x50x5",4.7,null,"M.S FLAT 45 x 8 ",2.8260000000000001,null,null,null,null,null,null,null,null,null,null,null,null,null,"ISMB 225 X 110",31.2,"Rmtr."]
[null,null,null,null,null,null,null,"ISA 100x100x10",14.912000000000001,null,"Uneq ISA 75x50x6",5.6,null,"M.S FLAT 50 x 8 ",3.14,null,null,null,null,null,null,null,null,null,null,null,null,null,"ISMB 250 X 125",37.299999999999997,"Rmtr."]
[null,null,null,null,null,null,null,"ISA 100x100x12",17.701000000000001,null,"Uneq ISA 75x50x6",7.4,null,"M.S FLAT 63 x 8 ",3.956,null,null,null,null,null,null,null,null,null,null,null,null,null,"ISMB 250 x 125 ","38.10","Rmtr."]
[null,null,null,null,null,null,null,"ISA 110x110x12",16.497,null,"Uneq ISA 75x50x10",9,null,"M.S FLAT 75 x 8 ",4.71,null,null,null,null,null,null,null,null,null,null,null,null,null,"ISMB 300 X 150",37.700000000000003,"Rmtr."]
[null,null,null,null,null,null,null,"ISA 130x130x10",19.699000000000002,null,"Uneq ISA 80x50x5",4.9000000000000004,null,"M.S FLAT 80 x 8 ",5.024,null,null,null,null,null,null,null,null,null,null,null,null,null,"ISMB 300 X 140",44.2,"Rmtr."]
[null,null,null,null,null,null,null,"ISA 150x150x10",22.803000000000001,null,"Uneq ISA 80x50x6",5.9,null,"M.S FLAT 90 x 8 ",5.6520000000000001,null,null,null,null,null,null,null,null,null,null,null,null,null,"ISMB 350 X 165",49.5,"Rmtr."]
[null,null,null,null,null,null,null,"ISA 150x150x12",27.199000000000002,null,"Uneq ISA 80x50x8",7.7,null,"M.S FLAT 100 x 8",0.628,null,null,null,null,null,null,null,null,null,null,null,null,null,"ISMB 350 X 140",52.4,"Rmtr."]
[null,null,null,null,null,null,null,"ISA 150x150x16",35.798999999999999,null,"Uneq ISA 80x50x10",9.4,null,"M.S FLAT 120 x 8",0.754,null,null,null,null,null,null,null,null,null,null,null,null,null,"ISMB 400 X 140",61.6,"Rmtr."]
[null,null,null,null,null,null,null,"ISA 150x150x20",44.1,null,null,null,null,"M.S FLAT 125 x 8",0.754,null,null,null,null,null,null,null,null,null,null,null,null,null,"ISMB 400 X 165",56.9,"Rmtr."]
[null,null,null,null,null,null,null,"ISA 200X200X12",36.6,null,null,null,null,"M.S FLAT 150 x 8",0.94199999999999995,null,null,null,null,null,null,null,null,null,null,null,null,null,"ISMB 450 X 150",72.400000000000006,"Rmtr."]
[null,null,null,null,null,null,null,null,null,null,null,null,null,"M.S FLAT 200 x 8",1.256,null,null,null,null,null,null,null,null,null,null,null,null,null,"ISMB 500 X 180",86.92,"Rmtr."]
[null,null,null,null,null,null,null,null,null,null,null,null,null,"M.S FLAT 25 x 10",1.9630000000000001,null,null,null,null,null,null,null,null,null,null,null,null,null,"ISMB 600 X 210",122.6,"Rmtr."]
[null,null,null,null,null,null,null,null,null,null,null,null,null,"M.S FLAT 32 x 10",2.512]
[null,null,null,null,null,null,null,null,null,null,null,null,null,"M.S FLAT 40 x 10",3.14]
[null,null,null,null,null,null,null,null,null,null,null,null,null,"M.S FLAT 45 x 10",3.5329999999999999]
[null,null,null,null,null,null,null,null,null,null,null,null,null,"M.S FLAT 50 x 10",3.9249999999999998,null,null,null,null,null,null,null,null,null,null,null,null,null,"ISA 20x20x3",0.89900000000000002,"Rmtr."]
[null,null,null,null,null,null,null,null,null,null,null,null,null,"M.S FLAT 63 x 10",4.9459999999999997,null,null,null,null,null,null,null,null,null,null,null,null,null,"ISA 25x25x3",1.099,"Rmtr."]
[null,null,null,null,null,null,null,null,null,null,null,null,null,"M.S FLAT 75 x 10",5.8879999999999999,null,null,null,null,null,null,null,null,null,null,null,null,null,"ISA 25x25x5",1.798,"Rmtr."]
[null,null,null,null,null,null,null,null,null,null,null,null,null,"M.S FLAT 100 x 10 ",0.78500000000000003,null,null,null,null,null,null,null,null,null,null,null,null,null,"ISA 31x31x3",1.28,"Rmtr."]
[null,null,null,null,null,null,null,null,null,null,null,null,null,"M.S FLAT  125 x 10 ",0.94199999999999995,null,null,null,null,null,null,null,null,null,null,null,null,null,"ISA 35x35x5",2.5990000000000002,"Rmtr."]
[null,null,null,null,null,null,null,null,null,null,null,null,null,"M.S FLAT  150 x 10 ",1.1779999999999999,null,null,null,null,null,null,null,null,null,null,null,null,null,"ISA 37x37x3",1.7,"Rmtr."]
[null,null,null,null,null,null,null,null,null,null,null,null,null,"M.S FLAT  200 x 10 ",1.57,null,null,null,null,null,null,null,null,null,null,null,null,null,"ISA 40x40x3",1.798,"Rmtr."]
[null,null,null,null,null,null,null,null,null,null,null,null,null,"M.S FLAT 25 x 12",2.355,null,null,null,null,null,null,null,null,null,null,null,null,null,"ISA 40x40x5",3,"Rmtr."]
[null,null,null,null,null,null,null,null,null,null,null,null,null,"M.S FLAT 32 x 12",3.0139999999999998,null,null,null,null,null,null,null,null,null,null,null,null,null,"ISA 40x40x6",3.5,"Rmtr."]
[null,null,null,null,null,null,null,null,null,null,null,null,null,"M.S FLAT 40 x 12",3.7679999999999998,null,null,null,null,null,null,null,null,null,null,null,null,null,"ISA 45x45x5",3.5,"Rmtr."]
[null,null,null,null,null,null,null,null,null,null,null,null,null,"M.S FLAT 45 x 12",4.2389999999999999,null,null,null,null,null,null,null,null,null,null,null,null,null,"ISA 50x50x5",3.8,"Rmtr."]
[null,null,null,null,null,null,null,null,null,null,null,null,null,"M.S FLAT 50 x 12",4.71,null,null,null,null,null,null,null,null,null,null,null,null,null,"ISA 50x50x6",4.5,"Rmtr."]
[null,null,null,null,null,null,null,null,null,null,null,null,null,"M.S FLAT 63 x 12",5.9349999999999996,null,null,null,null,null,null,null,null,null,null,null,null,null,"ISA 60x60x6",5.3970000000000002,"Rmtr."]
[null,null,null,null,null,null,null,null,null,null,null,null,null,"M.S FLAT 75 x 12",7.0650000000000004,null,null,null,null,null,null,null,null,null,null,null,null,null,"ISA 65x65x6",5.798,"Rmtr."]
[null,null,null,null,null,null,null,null,null,null,null,null,null,"M.S FLAT 100 x 12 ",9.42,null,null,null,null,null,null,null,null,null,null,null,null,null,"ISA 65x65x8",7.6970000000000001,"Rmtr."]
[null,null,null,null,null,null,null,null,null,null,null,null,null,"M.S FLAT 125 x 12 ",11.775,null,{"$f":"100*12*7.85/1000","v":9.42},null,null,null,null,null,null,null,null,null,null,null,"ISA 65x65x10",9.3970000000000002,"Rmtr."]
[null,null,null,null,null,null,null,null,null,null,null,null,null,"M.S FLAT 150 x 12 ",14.129999999999999,null,{"$f":"12*125*7.85/1000","v":11.775},null,null,null,null,null,null,null,null,null,null,null,"ISA 75x75x6",6.798,"Rmtr."]
[null,null,null,null,null,null,null,null,null,null,null,null,null,"M.S FLAT 200 x 12 ",18.84,null,{"$f":"150*12/1000*7.85","v":14.129999999999999},null,null,null,null,null,null,null,null,null,null,null,"ISA 75x75x8",8.8979999999999997,"Rmtr."]
[null,null,null,null,null,null,null,null,null,null,null,null,null,"M.S FLAT  25 x 16 ",3.14,null,{"$f":"200*12*7.85/1000","v":18.84},null,null,null,null,null,null,null,null,null,null,null,"ISA 75x75x10",10.997999999999999,"Rmtr."]
[null,null,null,null,null,null,null,null,null,null,null,null,null,"M.S FLAT  32 x 16 ",4.0190000000000001,null,{"$f":"25*16*7.85/1000","v":3.14},null,null,null,null,null,null,null,null,null,null,null,"ISA 80x80x6",7.2969999999999997,"Rmtr."]
[null,null,null,null,null,null,null,null,null,null,null,null,null,"M.S FLAT  40 x 16 ",5.024,null,null,null,null,null,null,null,null,null,null,null,null,null,"ISA 80x80x8",9.5969999999999995,"Rmtr."]
[null,null,null,null,null,null,null,null,null,null,null,null,null,"M.S FLAT  45 x 16 ",5.6520000000000001,null,null,null,null,null,null,null,null,null,null,null,null,null,"ISA 90x90x6",8.1989999999999998,"Rmtr."]
[null,null,null,null,null,null,null,null,null,null,null,null,null,"M.S FLAT  50 x 16 ",6.28,null,null,null,null,null,null,null,null,null,null,null,null,null,"ISA 90x90x8",10.801,"Rmtr."]
[null,null,null,null,null,null,null,null,null,null,null,null,null,"M.S FLAT  63 x 16 ",7.9130000000000003,null,null,null,null,null,null,null,null,null,null,null,null,null,"ISA 90x90x10",13.4,"Rmtr."]
[null,null,null,null,null,null,null,null,null,null,null,null,null,"M.S FLAT  75 x 16 ",9.42,null,null,null,null,null,null,null,null,null,null,null,null,null,"ISA 100x100x6",9.1999999999999993,"Rmtr."]
[null,null,null,null,null,null,null,null,null,null,null,null,null,"M.S FLAT  100 x 16",1.256,null,null,null,null,null,null,null,null,null,null,null,null,null,"ISA 100x100x8",12.097,"Rmtr."]
[null,null,null,null,null,null,null,null,null,null,null,null,null,"M.S FLAT  125 x 16",1.5069999999999999,null,null,null,null,null,null,null,null,null,null,null,null,null,"ISA 100x100x10",14.912000000000001,"Rmtr."]
[null,null,null,null,null,null,null,null,null,null,null,null,null,"M.S FLAT  150 x 16",1.8839999999999999,null,null,null,null,null,null,null,null,null,null,null,null,null,"ISA 100x100x12",17.701000000000001,"Rmtr."]
[null,null,null,null,null,null,null,null,null,null,null,null,null,"M.S FLAT  200 x 16",2.512,null,null,null,null,null,null,null,null,null,null,null,null,null,"ISA 110x110x12",16.497,"Rmtr."]
[null,null,null,null,null,null,null,null,null,null,null,null,null,"M.S FLAT  25 x 20 ",3.9249999999999998,null,null,null,null,null,null,null,null,null,null,null,null,null,"ISA 130x130x10",19.699000000000002,"Rmtr."]
[null,null,null,null,null,null,null,null,null,null,null,null,null,null,null,null,null,null,null,null,null,null,null,null,null,null,null,null,"ISA 150x150x10",22.803000000000001,"Rmtr."]
[null,null,null,null,null,null,null,null,null,null,null,null,null,null,null,null,null,null,null,null,null,null,null,null,null,null,null,null,"ISA 150x150x12",27.199000000000002,"Rmtr."]
[null,null,null,null,null,null,null,null,null,null,null,null,null,null,null,null,null,null,null,null,null,null,null,null,null,null,null,null,"ISA 150x150x16",35.798999999999999,"Rmtr."]
[null,null,null,null,null,null,null,null,null,null,null,null,null,null,null,null,null,null,null,null,null,null,null,null,null,null,null,null,"ISA 150x150x20",44.1,"Rmtr."]
[null,null,null,null,null,null,null,null,null,null,null,null,null,null,null,null,null,null,null,null,null,null,null,null,null,null,null,null,"ISA 200X200X12",36.6,"Rmtr."]
[]
[]
[null,null,null,null,null,null,null,null,null,null,null,null,null,null,null,null,null,null,null,null,null,null,null,null,null,null,null,null,"PLATE 5 mm",39.25,"Sqm"]
[null,null,null,null,null,null,null,null,null,null,null,null,null,null,null,null,null,null,null,null,null,null,null,null,null,null,null,null,"PLATE 6 mm",{"$f":"ROUND(6*7.85,3)","v":47.1},"Sqm"]
{"$rows_left_out":143}
{"sheet":"Readme","index":1,"n_rows":48,"n_cols":2,"rows_kept":48,"cut":false,"hidden":true,"merged":[]}
[null,"MILD Steel Calculator for M.S STRUCTURE"]
[null,"This is a Mild Steel Measurement Book designed for civil engineers, contractors, and construction professionals. It helps you easily calculate steel quantities and weights for various structural steel sections used in construction projects."]
[null,"Developer: Er. Kuljit Singh"]
[null,"Mobile: 8727060647"]
[null,"Email: arsh@arshavtar.in"]
[null,"⚡ QUICK START Open the file"]
[null,"Click \"Add New Row\""]
[null,"Enter Description in Column B"]
[null,"Select Element Mark and element thype"]
[null,"Enter Nos., Length, Width"]
[null,"Click \"Copy to Summary\" for report"]
[null,"Click \"View Summary\" to see report"]
[null,"© 2024 All Rights Reserved | M.S Steel Format"]
[]
[null,"📌 TO START A NEW PROJECT"]
[null,"Click the \"New Project\" button. This will clear all previous data from Row 6 onward, while keeping all formulas intact."]
[]
[null,"🎨 BUTTON FUNCTIONS Button Function Add New Row Inserts a new row for data entry Copy to Summary Creates summary report View Summary Goes to Summary sheet Update S.No. Re-numbers serial numbers Contact Developer Shows developer contact info ⚠️ DEMO VERSION LIMITATIONS Maximum 20 entries allowed"]
[]
[null,"Contact developer for full version:"]
[null,"Er. Kuljit Singh"]
[null,"Mobile: 8727060647"]
[null,"Email: arsh@arshavtar.in"]
[]
[null,"📝 TIPS FOR BEST USE Always start from row 7 (Rows above contain formulas)"]
[null,"Don't delete rows with formulas"]
[null,"Use dropdown lists for Element Mark and Elenent type"]
[null,"Description should be meaningful"]
[null,"Check Summary after each major entry"]
[]
[null,"🚀 KEY FEATURES ✅ User-friendly interface with buttons"]
[null,"✅ Auto-calculation of quantities and weights"]
[null,"✅ Drop-down lists for easy selection"]
[null,"✅ Auto-generated serial numbers"]
[null,"✅ Summary reports with totals"]
[null,"✅ Protected sheets to prevent accidental changes"]
[null,"✅ Demo version with 20-entry limit"]
[null,"✅ Contact developer feature"]
[null,"📧 SUPPORT For any issues or full version:"]
[null,"Contact developer for full version:"]
[null,"Er. Kuljit Singh"]
[null,"Mobile: 8727060647"]
[null,"Email: arsh@arshavtar.in"]
[]
[]
[null,"Developer: Er. Kuljit Singh"]
[null,"Mobile: 8727060647"]
[null,"Email: arsh@arshavtar.in"]

{"sheet":"Summary","index":2,"n_rows":5,"n_cols":5,"rows_kept":5,"cut":false,"hidden":true,"merged":[]}
["S.No","Element Type","Unit","Qty","Weight"]
[1,"ISMB ISMB 150 X 80","Rmtr.",24,360]
[2,"ISMC ISMC 125 x 65","Rmtr.",12,157.18]
[3,"ISMC ISMC 175 x 75","Rmtr.",12,235.16]
["TOTAL",null,null,{"$f":"SUM(D2:D4)","v":48},{"$f":"SUM(E2:E4)","v":752.34}]

{"sheet":"Entry","index":3,"n_rows":8,"n_cols":13,"rows_kept":8,"cut":false,"hidden":false,"merged":[]}
[null,null,null,"Company Name"]
[null,"Project:- "]
[]
[null,null,null,"Mild Steel Measurement Book"]
[null,"Description","Element Mark","Element Type","Unit","Nos.","Length","Width","Qnty","Wt. / Mtr.","Toal Weight",null,{"$f":"SUM(K:K)","v":752.34}]
[1,"c1","ISMB","ISMB 150 X 80",{"$f":"IF(ISERROR(VLOOKUP(D6,'DATA '!$AC$2:$AE$1022,3,FALSE)),\"\",VLOOKUP(D6,'DATA '!$AC$2:$AE$1022,3,FALSE))","v":"Rmtr."},4,6,null,{"$f":"IF(E6=\"Sqm\",F6*G6*H6,F6*G6)","v":24},{"$f":"IF(ISERROR(VLOOKUP(D6,'DATA '!$AC$2:$AD$1022,2,0)),\"\",VLOOKUP(D6,'DATA '!$AC$2:$AD$1022,2,0))","v":15},{"$f":"IF(ISERROR(IF(I6>0,ROUND(I6*J6,2),\"\")),0,IF(I6>0,ROUND(I6*J6,2),\"\"))","v":360}]
[1,"c2","ISMC","ISMC 125 x 65",{"$f":"IF(ISERROR(VLOOKUP(D7,'DATA '!$AC$2:$AE$1022,3,FALSE)),\"\",VLOOKUP(D7,'DATA '!$AC$2:$AE$1022,3,FALSE))","v":"Rmtr."},2,6,null,{"$f":"IF(E7=\"Sqm\",F7*G7*H7,F7*G7)","v":12},{"$f":"IF(ISERROR(VLOOKUP(D7,'DATA '!$AC$2:$AD$1022,2,0)),\"\",VLOOKUP(D7,'DATA '!$AC$2:$AD$1022,2,0))","v":13.098000000000001},{"$f":"IF(ISERROR(IF(I7>0,ROUND(I7*J7,2),\"\")),0,IF(I7>0,ROUND(I7*J7,2),\"\"))","v":157.18}]
[2,"b1","ISMC","ISMC 175 x 75",{"$f":"IF(ISERROR(VLOOKUP(D8,'DATA '!$AC$2:$AE$1022,3,FALSE)),\"\",VLOOKUP(D8,'DATA '!$AC$2:$AE$1022,3,FALSE))","v":"Rmtr."},4,3,null,{"$f":"IF(E8=\"Sqm\",F8*G8*H8,F8*G8)","v":12},{"$f":"IF(ISERROR(VLOOKUP(D8,'DATA '!$AC$2:$AD$1022,2,0)),\"\",VLOOKUP(D8,'DATA '!$AC$2:$AD$1022,2,0))","v":19.597000000000001},{"$f":"IF(ISERROR(IF(I8>0,ROUND(I8*J8,2),\"\")),0,IF(I8>0,ROUND(I8*J8,2),\"\"))","v":235.16}]